Home > Ldap Error > Ldap Error 20775

Ldap Error 20775

Contents

Error message Error obtaining connection. [LDAP: error code 49 - INVALID_CREDENTIALS: Bind failed: ERR_229 Cannot authenticate user uid=admin,ou=system] at org.wso2.carbon.user.core.ldap.LDAPUserStoreManager.(LDAPUserStoreManager.java:125) at org.wso2.carbon.user.core.ldap.ApacheDSUserStoreManager.(ApacheDSUserStoreManager.java:87) ... 25 more [2011-12-14 11:15:20,800] ERROR {org.wso2.carbon.user.core.common.DefaultRealmService} - Cannot Will this information enable you to resolve your issue? Cause: An error occurred reading the configuration files. Solution: Contact Sun Technical Support. 4105: Bulk import not supported by this backend. navigate here

Solution: Generate a symmetric key for the cryptography mechanism or choose a supported mechanism. 4787: Out of memory to create a buffer to hold the cleartext output (error code - string). Refer to the error log for more details. 4129: Bad configuration file. Using CATALINA_BASE: /home/UNIXHOME/fas/test/smrtsuite/install/smrtsuite-fromsrc_3.0.4.173984,173940-173984-173628-173506/bundles/smrtlink-analysisservices-gui/install/smrtlink-analysisservices-gui-fromsrc_3.0.4.173984/private/pacbio/smrtlink-analysisservices-gui/apache-tomcat-8.0.26 Using CATALINA_HOME: /home/UNIXHOME/fas/test/smrtsuite/install/smrtsuite-fromsrc_3.0.4.173984,173940-173984-173628-173506/bundles/smrtlink-analysisservices-gui/install/smrtlink-analysisservices-gui-fromsrc_3.0.4.173984/private/pacbio/smrtlink-analysisservices-gui/apache-tomcat-8.0.26 Using CATALINA_TMPDIR: /home/UNIXHOME/fas/test/smrtsuite/install/smrtsuite-fromsrc_3.0.4.173984,173940-173984-173628-173506/bundles/smrtlink-analysisservices-gui/install/smrtlink-analysisservices-gui-fromsrc_3.0.4.173984/private/pacbio/smrtlink-analysisservices-gui/apache-tomcat-8.0.26/temp Using JRE_HOME: /home/UNIXHOME/fas/test/smrtsuite/install/smrtsuite-fromsrc_3.0.4.173984,173940-173984-173628-173506/admin/bin/../../../../current/bundles/smrtlink-analysisservices-gui/current/private/thirdparty/jre/jre_8u40 Using CLASSPATH: /home/UNIXHOME/fas/test/smrtsuite/install/smrtsuite-fromsrc_3.0.4.173984,173940-173984-173628-173506/bundles/smrtlink-analysisservices-gui/install/smrtlink-analysisservices-gui-fromsrc_3.0.4.173984/private/pacbio/smrtlink-analysisservices-gui/apache-tomcat-8.0.26/bin/bootstrap.jar:/home/UNIXHOME/fas/test/smrtsuite/install/smrtsuite-fromsrc_3.0.4.173984,173940-173984-173628-173506/bundles/smrtlink-analysisservices-gui/install/smrtlink-analysisservices-gui-fromsrc_3.0.4.173984/private/pacbio/smrtlink-analysisservices-gui/apache-tomcat-8.0.26/bin/tomcat-juli.jar Using CATALINA_PID: /home/UNIXHOME/fas/test/smrtsuite/install/smrtsuite-fromsrc_3.0.4.173984,173940-173984-173628-173506/admin/bin/../../../../rwdir/run/catalina.pid Tomcat started. Solution: Check the entry and make sure that it has a DN. 5390: str2entry_dupcheck: entry has no dn. http://www.ca.com/us/support/ca-support-online/product-content/knowledgebase-articles/tec590094.aspx

Ldap Error Codes

No password storage scheme loaded. Solution: Stop the running import process before launching db2bak. 4617: Unable to import the database because it is being used by another slapd process Cause: Unable to import the database because Solution: Check that the lock file exists and is accessible. 4178: Could not open file filename in mode mode. Starting services daemon...

Cause: The error log filename could not be set, either because the filename was NULL or the path was invalid. Bind operations. 33 LDAP_ALIAS_PROBLEM Indicates that an error occurred when an alias was dereferenced. 34 LDAP_INVALID_DN_SYNTAX Indicates that the syntax of the DN is incorrect. (If the DN syntax is correct, Solution: Fix the client application. 5399: occurred while removing attribute values. Microsoft Ldap Error Codes To fix it, you need to regenerate the index.

Returns only when presented with valid user-name and password credential. 50 LDAP_INSUFFICIENT_ACCESS Indicates that the caller does not have sufficient rights to perform the requested operation. 51 LDAP_BUSY Indicates that the Ldap Error Code 49 80090308 Solution: Perform the following tasks: Check that the type is SLAPI_RESLIMIT_TYPE_INT Check that attrname is an LDAP attribute type that can be consulted in the bound entry to determine the limit’s Solution: Check the password file access rights and ensure that the file is of a reasonable size. 4802: Bad password file syntax: missing ”:’ preceding password. https://docs.oracle.com/cd/E19424-01/820-4814/errors-log-messages/index.html Solution: Correct the error and back up the configuration file manually. 4126: Failed to create lock.

Note – When using the error log for debugging, increase the log level progressively until the debugging data you need becomes evident in the log. Ldap Error Code 49 - Invalid Credentials Cause: BER value duplication has failed. Solution: Contact Sun Technical Support. 4171: slapi_vattr_filter_test_ext: found unknown filter type type Cause: While attempting to test whether an entry matches a filter, Directory Server encountered an invalid type. Failed to make request to http://smrtlink-release:8080 Failed to make request to http://smrtlink-release:8081/status Failed to make request to http://smrtlink-release:8081/secondary-analysis/datasets/subreads Services started successfully.

Ldap Error Code 49 80090308

Cause: Security initialization error. look at this web-site Cause: Unable to run db2ldif with the -r flag because the database is being used by another Directory Server process. Ldap Error Codes org.wso2.carbon.user.core.UserStoreException: nullType class java.lang.reflect.InvocationTargetException at org.wso2.carbon.user.core.common.DefaultRealm.createObjectWithOptions(DefaultRealm.java:241) at org.wso2.carbon.user.core.common.DefaultRealm.initializeObjects(DefaultRealm.java:152) at org.wso2.carbon.user.core.common.DefaultRealm.init(DefaultRealm.java:117) at org.wso2.carbon.user.core.common.DefaultRealmService.initializeRealm(DefaultRealmService.java:261) at org.wso2.carbon.user.core.common.DefaultRealmService.(DefaultRealmService.java:111) at org.wso2.carbon.user.core.common.DefaultRealmService.(DefaultRealmService.java:124) at org.wso2.carbon.user.core.internal.Activator.startDeploy(Activator.java:64) at org.wso2.carbon.user.core.internal.BundleCheckActivator.start(BundleCheckActivator.java:54) at org.eclipse.osgi.framework.internal.core.BundleContextImpl$1.run(BundleContextImpl.java:782) at java.security.AccessController.doPrivileged(Native Method) at org.eclipse.osgi.framework.internal.core.BundleContextImpl.startActivator(BundleContextImpl.java:773) at org.eclipse.osgi.framework.internal.core.BundleContextImpl.start(BundleContextImpl.java:754) at org.eclipse.osgi.framework.internal.core.BundleHost.startWorker(BundleHost.java:352) Active Directory Ldap Error Codes Solution: Check that the file exists and that it has the appropriate access rights. 4110: Could only read value of value bytes from configuration file filename.

Cause: Plug-in dependencies have not been configured correctly. http://jvmwriter.org/ldap-error/ldap-error-91-cannot-connect-to-the-ldap-server.html Solution: Increase the virtual memory available to your server, or reduce the size of the server’s maximum entries in cache (cachesize) or maximum database cache size (dbcachesize) parameters. 5249: The entry Error message Error obtaining connection. [LDAP: error code 49 - INVALID_CREDENTIALS: Bind failed: ERR_229 Cannot authenticate user uid=admin,ou=system] at org.wso2.carbon.user.core.ldap.LDAPUserStoreManager.(LDAPUserStoreManager.java:125) at org.wso2.carbon.user.core.ldap.ApacheDSUserStoreManager.(ApacheDSUserStoreManager.java:87) ... 25 more [2011-12-14 11:15:20,802] ERROR {org.wso2.carbon.user.core.internal.Activator} - Cannot Returns only when presented with a valid username and valid password credential. 49 / 531 RESTRICTED_TO_SPECIFIC_MACHINES Indicates an Active Directory (AD) AcceptSecurityContext data error that is logon failure caused because the Ldap Error Code 49 Acceptsecuritycontext Error Data 52e V1db1

Solution: The request is invalid. Solution: Check that the value of the attribute nsslapd-errorlog under cn=config is valid, and that the path exists. 5252: Undefined value for errorlog level. Restart Directory Server. 4175: FrontendConfig_init: failed to initialize read-write lock structure. his comment is here This is an issue with the specific LDAP user object/account which should be investigated by the LDAP administrator. 49 / 701 ACCOUNT_EXPIRED Indicates an Active Directory (AD) AcceptSecurityContext data error that

Solution: Contact Sun Technical Support. 4626: slapi_add_internal: add_values for type type failed. Ldap Error Code 32 Solution: None - this type of database cannot be backed up. 5009: Cannot perform a backup with pre-V3 backend plugin variable Cause: You are using a version of the backend plug-in Solution: Check the message in the error log for more information. 4164: Bad BER decoding of an attribute value assertion.

Solution: Check the error log for more information. 4779: Security initialization: Unable to create PinObj (error error.) Cause: Security initialization error.

Cause: The security initialization required by the attribute encryption feature failed. Check that SSL has been configured correctly (certificate file ciphers.) 4737: Security Initialization failed: unable to read configuration from dn. The dynamic library may not be present, may be inaccessible, or may be using another library that is not present. 5645: Node node wants to define a distribution plugin but either Ldap: Error Code 49 - 80090308: Ldaperr: Dsid-0c0903a8 Cause: Security configuration has not been completed.

Solution: Check that the password for the DN is correct. 4775: ldap_sasl_bind(LDAP_SASL_EXTERNAL) (error error) Cause: The bind attempt failed with the SASL EXTERNAL method. Solution: Contact Sun Technical Support. 5020: Unable to allocate new task for index. Cause: The request to set the maximum number of file descriptors has failed. weblink Cause: Unable to start Directory Server because it is already running.

Solution: Verify all backends are in a correct and functional state. 4212: Server is already suspending all operations. Solution: Ensure that the certificate has been imported into the database with both its private and public keys. (This is usually performed as part of the process beginning with a certificate Cause: When trying to convert the absolute path, the server was unable to determine the current directory. Solution: Check the application that added or modified the entry. 5896: Entry entry attribute attribute required by objectclass objectclass is missing.